Reaction Details
TargetDelta-type opioid receptor
LigandBDBM50207839
Substrate/Competitorn/a
Meas. Tech.ChEMBL_455045 (CHEMBL887074)
IC50 0.232±n/a nM
Citation Dolle, REMichaut, MMartinez-Teipel, BBelanger, SGraczyk, TMDeHaven, RN Further studies of tyrosine surrogates in opioid receptor peptide ligands. Bioorg Med Chem Lett17:2656-60 (2007) 
 
Delta-type opioid receptor
Name:Delta-type opioid receptor
Type:Enzyme Catalytic Domain
Mol. Mass.:40577.25
Organism:MOUSE
Description:P32300
Residue:372
BDBM50207839
NameBDBM50207839
Synonyms:CHEMBL396356 | H-Tyr-c[cys-Gly-Phe(p-NO2)-cys]NH2
TypeSmall organic molecule
Emp. Form.C26H31N7O8S2
Mol. Mass.633.696
SMILESN[C@@H](Cc1ccc(O)cc1)C(=O)N[C@H]1CSSC[C@H](NC(=O)[C@H](Cc2ccc(cc2)[N+]([O-])=O)NC(=O)CNC1=O)C(N)=O