Reaction Details
TargetKappa-type opioid receptor
LigandBDBM50207821
Substrate/Competitorn/a
Meas. Tech.ChEMBL_455041 (CHEMBL887070)
Ki>10000±n/a nM
Citation Dolle, REMichaut, MMartinez-Teipel, BBelanger, SGraczyk, TMDeHaven, RN Further studies of tyrosine surrogates in opioid receptor peptide ligands. Bioorg Med Chem Lett17:2656-60 (2007) 
 
Kappa-type opioid receptor
Name:Kappa-type opioid receptor
Type:G Protein-Coupled Receptor (GPCR)
Mol. Mass.:42648.76
Organism:Homo sapiens (Human)
Description:P41145
Residue:380
BDBM50207821
NameBDBM50207821
Synonyms:CHEMBL247064 | H-Aba-ala-Gly-Phe-leu-OH
TypeSmall organic molecule
Emp. Form.C30H39N7O6S
Mol. Mass.625.739
SMILESCC(C)C[C@H](NC(=O)[C@H](Cc1ccccc1)NC(=O)CNC(=O)[C@H](C)NC(=O)[C@@H](N)Cc1ccc2nc(N)sc2c1)C(O)=O