Reaction Details
TargetMu-type opioid receptor
LigandBDBM50207841
Substrate/Competitorn/a
Meas. Tech.ChEMBL_455039 (CHEMBL887068)
Ki>10000±n/a nM
Citation Dolle, REMichaut, MMartinez-Teipel, BBelanger, SGraczyk, TMDeHaven, RN Further studies of tyrosine surrogates in opioid receptor peptide ligands. Bioorg Med Chem Lett17:2656-60 (2007) 
 
Mu-type opioid receptor
Name:Mu-type opioid receptor
Type:G Protein-Coupled Receptor (GPCR)
Mol. Mass.:44789.51
Organism:Homo sapiens (Human)
Description:P35372
Residue:400
BDBM50207841
NameBDBM50207841
Synonyms:CHEMBL395863 | H-Poa-Gly-Gly-Phe-Leu-OH
TypeSmall organic molecule
Emp. Form.C27H36N6O7
Mol. Mass.556.6107
SMILESCC(C)C[C@H](NC(=O)[C@H](Cc1ccccc1)NC(=O)CNC(=O)CNC(=O)[C@@H](N)Cc1cc[n+]([O-])cc1)C(O)=O