Reaction Details
TargetAngiopoietin-1 receptor
LigandBDBM14974
Substrate/Competitorn/a
Meas. Tech.ChEMBL_455047 (CHEMBL887076)
IC50 1±n/a nM
Citation Hodous, BLGeuns-Meyer, SDHughes, PEAlbrecht, BKBellon, SCaenepeel, SCee, VJChaffee, SCEmery, MFretland, JGallant, PGu, YJohnson, REKim, JLLong, AMMorrison, MOlivieri, PRPatel, VFPolverino, ARose, PWang, LZhao, H Synthesis, structural analysis, and SAR studies of triazine derivatives as potent, selective Tie-2 inhibitors. Bioorg Med Chem Lett17:2886-9 (2007) 
 
Angiopoietin-1 receptor
Name:Angiopoietin-1 receptor
Type:Enzyme
Mol. Mass.:125835.70
Organism:Homo sapiens (Human)
Description:Q02763
Residue:1124
BDBM14974
NameBDBM14974
Synonyms:CHEMBL221484 N-{3-[3-(dimethylamino)propyl]-5-(trifluoromethyl)phenyl}-4-methyl-3-{[3-(pyrimidin-4-yl)pyridin-2-yl]amino}benzamide | pyridinyl pyrimidine 39
TypeSmall organic molecule
Emp. Form.C29H29F3N6O
Mol. Mass.534.5754
SMILESCN(C)CCCc1cc(NC(=O)c2ccc(C)c(Nc3ncccc3-c3ccncn3)c2)cc(c1)C(F)(F)F