Reaction Details
TargetPotassium voltage-gated channel subfamily A member 5
LigandBDBM50207909
Substrate/Competitorn/a
Meas. Tech.ChEMBL_455075 (CHEMBL887104)
IC50 150±n/a nM
Citation Gross, MFBeaudoin, SMcNaughton-Smith, GAmato, GSCastle, NAHuang, CZou, AYu, W Aryl sulfonamido indane inhibitors of the Kv1.5 ion channel. Bioorg Med Chem Lett17:2849-53 (2007) 
 
Potassium voltage-gated channel subfamily A member 5
Name:Potassium voltage-gated channel subfamily A member 5
Type:Enzyme
Mol. Mass.:67222.47
Organism:Homo sapiens (Human)
Description:P22460
Residue:613
BDBM50207909
NameBDBM50207909
Synonyms:CHEMBL239805 | N-(3-(4-ethylphenylsulfonamido)-2,3-dihydro-1H-inden-5-yl)-3-methoxybenzamide
TypeSmall organic molecule
Emp. Form.C25H26N2O4S
Mol. Mass.450.55
SMILESCCc1ccc(cc1)S(=O)(=O)NC1CCc2ccc(NC(=O)c3cccc(OC)c3)cc12