Reaction Details
TargetPotassium voltage-gated channel subfamily A member 5
LigandBDBM50207912
Substrate/Competitorn/a
Meas. Tech.ChEMBL_455075 (CHEMBL887104)
IC50 200±n/a nM
Citation Gross, MFBeaudoin, SMcNaughton-Smith, GAmato, GSCastle, NAHuang, CZou, AYu, W Aryl sulfonamido indane inhibitors of the Kv1.5 ion channel. Bioorg Med Chem Lett17:2849-53 (2007) 
 
Potassium voltage-gated channel subfamily A member 5
Name:Potassium voltage-gated channel subfamily A member 5
Type:Enzyme
Mol. Mass.:67222.47
Organism:Homo sapiens (Human)
Description:P22460
Residue:613
BDBM50207912
NameBDBM50207912
Synonyms:CHEMBL239808 | N-((8R,9R)-9-(4-ethylphenylsulfonamido)-8-hydroxy-6,7,8,9-tetrahydro-5H-benzo[7]annulen-2-yl)-3-methoxybenzamide
TypeSmall organic molecule
Emp. Form.C27H30N2O5S
Mol. Mass.494.603
SMILESCCc1ccc(cc1)S(=O)(=O)N[C@H]1[C@H](O)CCCc2ccc(NC(=O)c3cccc(OC)c3)cc12