Reaction Details
TargetMuscarinic acetylcholine receptor M3
LigandBDBM50208002
Substrate/Competitorn/a
Meas. Tech.ChEMBL_429171 (CHEMBL914427)
Ki 2.57±n/a nM
Citation Peretto, IForlani, RFossati, CGiardina, GAGiardini, AGuala, MLa Porta, EPetrillo, PRadaelli, SRadice, LRaveglia, LFSantoro, EScudellaro, RScarpitta, FBigogno, CMisiano, PDondio, GMRizzi, AArmani, EAmari, GCivelli, MVilletti, GPatacchini, RBergamaschi, MDelcanale, MSalcedo, CFernández, AGImbimbo, BP Discovery of diaryl imidazolidin-2-one derivatives, a novel class of muscarinic M3 selective antagonists (Part 1). J Med Chem50:1571-83 (2007) 
 
Muscarinic acetylcholine receptor M3
Name:Muscarinic acetylcholine receptor M3
Type:Enzyme
Mol. Mass.:66151.03
Organism:Homo sapiens (Human)
Description:P20309
Residue:590
BDBM50208002
NameBDBM50208002
Synonyms:3-(1-benzyl-piperidin-4-yl)-5-phenyl-5-cyclohexyl-imidazolidin-2-one | CHEMBL223267
TypeSmall organic molecule
Emp. Form.C27H35N3O
Mol. Mass.417.5863
SMILESO=C1NC(CN1C1CCN(Cc2ccccc2)CC1)(C1CCCCC1)c1ccccc1