Reaction Details
TargetMuscarinic acetylcholine receptor M2
LigandBDBM50208011
Substrate/Competitorn/a
Meas. Tech.ChEMBL_429169 (CHEMBL914425)
Ki 908±n/a nM
Citation Peretto, IForlani, RFossati, CGiardina, GAGiardini, AGuala, MLa Porta, EPetrillo, PRadaelli, SRadice, LRaveglia, LFSantoro, EScudellaro, RScarpitta, FBigogno, CMisiano, PDondio, GMRizzi, AArmani, EAmari, GCivelli, MVilletti, GPatacchini, RBergamaschi, MDelcanale, MSalcedo, CFernández, AGImbimbo, BP Discovery of diaryl imidazolidin-2-one derivatives, a novel class of muscarinic M3 selective antagonists (Part 1). J Med Chem50:1571-83 (2007) 
 
Muscarinic acetylcholine receptor M2
Name:Muscarinic acetylcholine receptor M2
Type:GPCR
Mol. Mass.:51730.61
Organism:Homo sapiens (Human)
Description:P08172
Residue:466
BDBM50208011
NameBDBM50208011
Synonyms:3-(1-benzyl-piperidin-4-yl)-5,5-diphenyl-oxazolidin-2-one | CHEMBL225387
TypeSmall organic molecule
Emp. Form.C27H28N2O2
Mol. Mass.412.5234
SMILESO=C1OC(CN1C1CCN(Cc2ccccc2)CC1)(c1ccccc1)c1ccccc1