Reaction Details
TargetMuscarinic acetylcholine receptor M3
LigandBDBM50208000
Substrate/Competitorn/a
Meas. Tech.ChEMBL_429171 (CHEMBL914427)
Ki 228±n/a nM
Citation Peretto, IForlani, RFossati, CGiardina, GAGiardini, AGuala, MLa Porta, EPetrillo, PRadaelli, SRadice, LRaveglia, LFSantoro, EScudellaro, RScarpitta, FBigogno, CMisiano, PDondio, GMRizzi, AArmani, EAmari, GCivelli, MVilletti, GPatacchini, RBergamaschi, MDelcanale, MSalcedo, CFernández, AGImbimbo, BP Discovery of diaryl imidazolidin-2-one derivatives, a novel class of muscarinic M3 selective antagonists (Part 1). J Med Chem50:1571-83 (2007) 
 
Muscarinic acetylcholine receptor M3
Name:Muscarinic acetylcholine receptor M3
Type:Enzyme
Mol. Mass.:66151.03
Organism:Homo sapiens (Human)
Description:P20309
Residue:590
BDBM50208000
NameBDBM50208000
Synonyms:3-(1-phenoxyethyl-piperidin-4-yl)-5,5-diphenyl-imidazolidin-2-one | CHEMBL426393
TypeSmall organic molecule
Emp. Form.C28H31N3O2
Mol. Mass.441.5646
SMILESO=C1NC(CN1C1CCN(CCOc2ccccc2)CC1)(c1ccccc1)c1ccccc1