Reaction Details
TargetMuscarinic acetylcholine receptor M2
LigandBDBM50208003
Substrate/Competitorn/a
Meas. Tech.ChEMBL_429169 (CHEMBL914425)
Ki 225±n/a nM
Citation Peretto, IForlani, RFossati, CGiardina, GAGiardini, AGuala, MLa Porta, EPetrillo, PRadaelli, SRadice, LRaveglia, LFSantoro, EScudellaro, RScarpitta, FBigogno, CMisiano, PDondio, GMRizzi, AArmani, EAmari, GCivelli, MVilletti, GPatacchini, RBergamaschi, MDelcanale, MSalcedo, CFernández, AGImbimbo, BP Discovery of diaryl imidazolidin-2-one derivatives, a novel class of muscarinic M3 selective antagonists (Part 1). J Med Chem50:1571-83 (2007) 
 
Muscarinic acetylcholine receptor M2
Name:Muscarinic acetylcholine receptor M2
Type:GPCR
Mol. Mass.:51730.61
Organism:Homo sapiens (Human)
Description:P08172
Residue:466
BDBM50208003
NameBDBM50208003
Synonyms:3-(1-(3-methylbenzyl)-piperidin-4-yl)-5,5-diphenyl-imidazolidin-2-one | CHEMBL222388
TypeSmall organic molecule
Emp. Form.C28H31N3O
Mol. Mass.425.5652
SMILESCc1cccc(CN2CCC(CC2)N2CC(NC2=O)(c2ccccc2)c2ccccc2)c1