Reaction Details
TargetMuscarinic acetylcholine receptor M3
LigandBDBM50207986
Substrate/Competitorn/a
Meas. Tech.ChEMBL_429171 (CHEMBL914427)
Ki 152±n/a nM
Citation Peretto, IForlani, RFossati, CGiardina, GAGiardini, AGuala, MLa Porta, EPetrillo, PRadaelli, SRadice, LRaveglia, LFSantoro, EScudellaro, RScarpitta, FBigogno, CMisiano, PDondio, GMRizzi, AArmani, EAmari, GCivelli, MVilletti, GPatacchini, RBergamaschi, MDelcanale, MSalcedo, CFernández, AGImbimbo, BP Discovery of diaryl imidazolidin-2-one derivatives, a novel class of muscarinic M3 selective antagonists (Part 1). J Med Chem50:1571-83 (2007) 
 
Muscarinic acetylcholine receptor M3
Name:Muscarinic acetylcholine receptor M3
Type:Enzyme
Mol. Mass.:66151.03
Organism:Homo sapiens (Human)
Description:P20309
Residue:590
BDBM50207986
NameBDBM50207986
Synonyms:3-(1-benzyl-piperidin-4-yl)-5,5-dibenzyl-imidazolidine-2,4-dione | CHEMBL221713
TypeSmall organic molecule
Emp. Form.C29H33N3O
Mol. Mass.439.5918
SMILESO=C1NC(Cc2ccccc2)(Cc2ccccc2)CN1C1CCN(Cc2ccccc2)CC1