Reaction Details
TargetMuscarinic acetylcholine receptor M3
LigandBDBM50208026
Substrate/Competitorn/a
Meas. Tech.ChEMBL_429171 (CHEMBL914427)
Ki 26.8±n/a nM
Citation Peretto, IForlani, RFossati, CGiardina, GAGiardini, AGuala, MLa Porta, EPetrillo, PRadaelli, SRadice, LRaveglia, LFSantoro, EScudellaro, RScarpitta, FBigogno, CMisiano, PDondio, GMRizzi, AArmani, EAmari, GCivelli, MVilletti, GPatacchini, RBergamaschi, MDelcanale, MSalcedo, CFernández, AGImbimbo, BP Discovery of diaryl imidazolidin-2-one derivatives, a novel class of muscarinic M3 selective antagonists (Part 1). J Med Chem50:1571-83 (2007) 
 
Muscarinic acetylcholine receptor M3
Name:Muscarinic acetylcholine receptor M3
Type:Enzyme
Mol. Mass.:66151.03
Organism:Homo sapiens (Human)
Description:P20309
Residue:590
BDBM50208026
NameBDBM50208026
Synonyms:1-(1-benzyl-piperidin-4-yl)-3-benzyl-4-phenyl-imidazolidin-2-one | CHEMBL223188
TypeSmall organic molecule
Emp. Form.C28H31N3O
Mol. Mass.425.5652
SMILESO=C1N(Cc2ccccc2)C(CN1C1CCN(Cc2ccccc2)CC1)c1ccccc1