Reaction Details
TargetMuscarinic acetylcholine receptor M3
LigandBDBM50208057
Substrate/Competitorn/a
Meas. Tech.ChEMBL_429188 (CHEMBL913822)
Ki 0.7±n/a nM
Citation Peretto, IFossati, CGiardina, GAGiardini, AGuala, MLa Porta, EPetrillo, PRadaelli, SRadice, LRaveglia, LFSantoro, EScudellaro, RScarpitta, FCerri, AMenegon, SDondio, GMRizzi, AArmani, EAmari, GCivelli, MVilletti, GPatacchini, RBergamaschi, MBassani, FDelcanale, MImbimbo, BP Discovery of diaryl imidazolidin-2-one derivatives, a novel class of muscarinic M3 selective antagonists (Part 2). J Med Chem50:1693-7 (2007) 
 
Muscarinic acetylcholine receptor M3
Name:Muscarinic acetylcholine receptor M3
Type:Enzyme
Mol. Mass.:66151.03
Organism:Homo sapiens (Human)
Description:P20309
Residue:590
BDBM50208057
NameBDBM50208057
Synonyms:1-methyl-3-(2-oxo-4,4-diphenyl-imidazolidin-1-yl)-1-(3-phenyl-propyl)-pyrrolidinium | CHEMBL374452
TypeSmall organic molecule
Emp. Form.C29H34N3O
Mol. Mass.440.5992
SMILESC[N+]1(CCCc2ccccc2)CCC(C1)N1CC(NC1=O)(c1ccccc1)c1ccccc1