Reaction Details
TargetCholecystokinin receptor type A
LigandBDBM50208418
Substrate/Competitorn/a
Meas. Tech.ChEMBL_443246 (CHEMBL893496)
IC50 197±n/a nM
Citation Tiwari, AKMishra, AKBajpai, AMishra, PSingh, SSinha, DSingh, VK Synthesis and evaluation of novel benzimidazole derivative [Bz-Im] and its radio/biological studies. Bioorg Med Chem Lett17:2749-55 (2007) 
 
Cholecystokinin receptor type A
Name:Cholecystokinin receptor type A
Type:Enzyme Catalytic Domain
Mol. Mass.:49676.37
Organism:RAT
Description:Cholecystokinin central 0 RAT::P30551
Residue:444
BDBM50208418
NameBDBM50208418
Synonyms:2-[5-((E)-2-biphenyl-4-yl-vinyl)-2-hydroxy-benzo[4,5]imidazo[1,2-a]quinolin-1-ylmethyl]-isoindole-1,3-dione VL-0494
TypeSmall organic molecule
Emp. Form.C38H25N3O3
Mol. Mass.571.6234
SMILESOc1ccc2c(\C=C\c3ccc(cc3)-c3ccccc3)cc3nc4ccccc4n3c2c1CN1C(=O)c2ccccc2C1=O