Reaction Details
TargetSodium-dependent serotonin transporter
LigandBDBM50208769
Substrate/Competitorn/a
Meas. Tech.ChEMBL_443351 (CHEMBL893599)
Ki 0.43±n/a nM
Citation Lee, JHChoi, YHLim, YJLee, BSChi, DYJin, C Syntheses and binding affinities of 6-nitroquipazine analogues for serotonin transporter. Part 5: 2'-Substituted 6-nitroquipazines. Bioorg Med Chem15:3499-504 (2007) 
 
Sodium-dependent serotonin transporter
Name:Sodium-dependent serotonin transporter
Type:Multi-pass membrane protein
Mol. Mass.:70168.43
Organism:Rattus norvegicus (rat)
Description:P31652
Residue:630
BDBM50208769
NameBDBM50208769
Synonyms:2-[2-(hydroxymethyl)piperazin-1-yl]-6-nitroquinoline | CHEMBL389365
TypeSmall organic molecule
Emp. Form.C14H16N4O3
Mol. Mass.288.3018
SMILESOCC1CNCCN1c1ccc2cc(ccc2n1)[N+]([O-])=O