Reaction Details
TargetProstaglandin G/H synthase 1
LigandBDBM7462
Substrate/Competitorn/a
Meas. Tech.ChEMBL_434257 (CHEMBL917001)
IC50>100000±n/a nM
Citation Deng, SPalu, KWest, BJSu, CXZhou, BNJensen, JC Lipoxygenase inhibitory constituents of the fruits of noni (Morinda citrifolia) collected in Tahiti. J Nat Prod70:859-62 (2007) 
 
Prostaglandin G/H synthase 1
Name:Prostaglandin G/H synthase 1
Type:Enzyme
Mol. Mass.:68692.62
Organism:Homo sapiens (Human)
Description:P23219
Residue:599
BDBM7462
NameBDBM7462
Synonyms:3,5,7-trihydroxy-2-(4-hydroxyphenyl)-4H-chromen-4-one CHEMBL150 Kaempferol (Kmp) kaempferol
TypeSmall organic molecule
Emp. Form.C15H10O6
Mol. Mass.286.2363
SMILESOc1ccc(cc1)-c1oc2cc(O)cc(O)c2c(=O)c1O