Reaction Details
TargetProstaglandin G/H synthase 2
LigandBDBM50208822
Substrate/Competitorn/a
Meas. Tech.ChEMBL_434256 (CHEMBL917000)
IC50>100000±n/a nM
Citation Deng, SPalu, KWest, BJSu, CXZhou, BNJensen, JC Lipoxygenase inhibitory constituents of the fruits of noni (Morinda citrifolia) collected in Tahiti. J Nat Prod70:859-62 (2007) 
 
Prostaglandin G/H synthase 2
Name:Prostaglandin G/H synthase 2
Type:Enzyme
Mol. Mass.:69003.89
Organism:Homo sapiens (Human)
Description:Recombinant Cox-2 provided by Cayman (Cayman Chemical Co.,Ann Arbor, MI).
Residue:604
BDBM50208822
NameBDBM50208822
Synonyms:(-)-3,3'-bisdemethylpinoresinol | CHEMBL227187
TypeSmall organic molecule
Emp. Form.C18H18O6
Mol. Mass.330.3319
SMILESOc1ccc(cc1O)[C@@H]1OC[C@@H]2[C@H]1CO[C@H]2c1ccc(O)c(O)c1