Reaction Details
TargetPolyunsaturated fatty acid lipoxygenase ALOX15
LigandBDBM50292291
Substrate/Competitorn/a
Meas. Tech.ChEMBL_434255 (CHEMBL916999)
IC50 3500±n/a nM
Citation Deng, SPalu, KWest, BJSu, CXZhou, BNJensen, JC Lipoxygenase inhibitory constituents of the fruits of noni (Morinda citrifolia) collected in Tahiti. J Nat Prod70:859-62 (2007) 
 
Polyunsaturated fatty acid lipoxygenase ALOX15
Name:Polyunsaturated fatty acid lipoxygenase ALOX15
Type:Enzyme
Mol. Mass.:75309.71
Organism:Oryctolagus cuniculus (rabbit)
Description:15-LO enzyme was purified from phenylhydrazine treated rabbits.
Residue:663
BDBM50292291
NameBDBM50292291
Synonyms:(-)-pinoresinol | CHEMBL460862
TypeSmall organic molecule
Emp. Form.C20H22O6
Mol. Mass.358.3851
SMILESCOc1cc(ccc1O)[C@@H]1OC[C@H]2[C@@H]1CO[C@H]2c1ccc(O)c(OC)c1