Reaction Details
TargetCannabinoid receptor 1
LigandBDBM50208948
Substrate/Competitorn/a
Meas. Tech.ChEMBL_438557 (CHEMBL887658)
Ki 2.2±n/a nM
Citation Smith, RAFathi, ZAchebe, FAkuche, CBrown, SEChoi, SFan, JJenkins, SKluender, HCKonkar, ALavoie, RMays, RNatoli, JO'Connor, SJOrtiz, AASu, NTaing, CTomlinson, STritto, TWang, GWirtz, SNWong, WYang, XFYing, SZhang, Z Optimization of imidazole amide derivatives as cannabinoid-1 receptor antagonists for the treatment of obesity. Bioorg Med Chem Lett17:2706-11 (2007) 
 
Cannabinoid receptor 1
Name:Cannabinoid receptor 1
Type:G Protein-Coupled Receptor (GPCR)
Mol. Mass.:52868.96
Organism:Homo sapiens (Human)
Description:P21554
Residue:472
BDBM50208948
NameBDBM50208948
Synonyms:2-(2-chlorophenyl)-1-(4-chlorophenyl)-N-cyclohexyl-1H-imidazole-4-carboxamide | CHEMBL389175
TypeSmall organic molecule
Emp. Form.C22H21Cl2N3O
Mol. Mass.414.328
SMILESClc1ccc(cc1)-n1cc(nc1-c1ccccc1Cl)C(=O)NC1CCCCC1