Reaction Details
TargetCannabinoid receptor 1
LigandBDBM50208968
Substrate/Competitorn/a
Meas. Tech.ChEMBL_438557 (CHEMBL887658)
Ki 5±n/a nM
Citation Smith, RAFathi, ZAchebe, FAkuche, CBrown, SEChoi, SFan, JJenkins, SKluender, HCKonkar, ALavoie, RMays, RNatoli, JO'Connor, SJOrtiz, AASu, NTaing, CTomlinson, STritto, TWang, GWirtz, SNWong, WYang, XFYing, SZhang, Z Optimization of imidazole amide derivatives as cannabinoid-1 receptor antagonists for the treatment of obesity. Bioorg Med Chem Lett17:2706-11 (2007) 
 
Cannabinoid receptor 1
Name:Cannabinoid receptor 1
Type:G Protein-Coupled Receptor (GPCR)
Mol. Mass.:52868.96
Organism:Homo sapiens (Human)
Description:P21554
Residue:472
BDBM50208968
NameBDBM50208968
Synonyms:2-(2-chlorophenyl)-1-(4-chlorophenyl)-5-ethyl-N-((1S,2S)-2-hydroxycyclohexyl)-1H-imidazole-4-carboxamide | CHEMBL230800
TypeSmall organic molecule
Emp. Form.C24H25Cl2N3O2
Mol. Mass.458.38
SMILESCCc1c(nc(-c2ccccc2Cl)n1-c1ccc(Cl)cc1)C(=O)N[C@H]1CCCC[C@@H]1O