Reaction Details
TargetCannabinoid receptor 1
LigandBDBM50208969
Substrate/Competitorn/a
Meas. Tech.ChEMBL_438557 (CHEMBL887658)
Ki 6.3±n/a nM
Citation Smith, RAFathi, ZAchebe, FAkuche, CBrown, SEChoi, SFan, JJenkins, SKluender, HCKonkar, ALavoie, RMays, RNatoli, JO'Connor, SJOrtiz, AASu, NTaing, CTomlinson, STritto, TWang, GWirtz, SNWong, WYang, XFYing, SZhang, Z Optimization of imidazole amide derivatives as cannabinoid-1 receptor antagonists for the treatment of obesity. Bioorg Med Chem Lett17:2706-11 (2007) 
 
Cannabinoid receptor 1
Name:Cannabinoid receptor 1
Type:G Protein-Coupled Receptor (GPCR)
Mol. Mass.:52868.96
Organism:Homo sapiens (Human)
Description:P21554
Residue:472
BDBM50208969
NameBDBM50208969
Synonyms:2-(2-chlorophenyl)-1-(4-chlorophenyl)-N-((1S,2R)-2-hydroxy-2,3-dihydro-1H-inden-1-yl)-1H-imidazole-4-carboxamide | CHEMBL229967
TypeSmall organic molecule
Emp. Form.C25H19Cl2N3O2
Mol. Mass.464.343
SMILESO[C@@H]1Cc2ccccc2[C@@H]1NC(=O)c1cn(c(n1)-c1ccccc1Cl)-c1ccc(Cl)cc1