Reaction Details
TargetCannabinoid receptor 1
LigandBDBM50208973
Substrate/Competitorn/a
Meas. Tech.ChEMBL_438557 (CHEMBL887658)
Ki 7.2±n/a nM
Citation Smith, RAFathi, ZAchebe, FAkuche, CBrown, SEChoi, SFan, JJenkins, SKluender, HCKonkar, ALavoie, RMays, RNatoli, JO'Connor, SJOrtiz, AASu, NTaing, CTomlinson, STritto, TWang, GWirtz, SNWong, WYang, XFYing, SZhang, Z Optimization of imidazole amide derivatives as cannabinoid-1 receptor antagonists for the treatment of obesity. Bioorg Med Chem Lett17:2706-11 (2007) 
 
Cannabinoid receptor 1
Name:Cannabinoid receptor 1
Type:G Protein-Coupled Receptor (GPCR)
Mol. Mass.:52868.96
Organism:Homo sapiens (Human)
Description:P21554
Residue:472
BDBM50208973
NameBDBM50208973
Synonyms:1-(4-chlorophenyl)-N-cyclohexyl-2-(2,4-dimethylphenyl)-1H-imidazole-4-carboxamide | CHEMBL229698
TypeSmall organic molecule
Emp. Form.C24H26ClN3O
Mol. Mass.407.936
SMILESCc1ccc(-c2nc(cn2-c2ccc(Cl)cc2)C(=O)NC2CCCCC2)c(C)c1