Reaction Details
TargetIntegrin alpha-V/beta-3
LigandBDBM50209133
Substrate/Competitorn/a
Meas. Tech.ChEMBL_436005 (CHEMBL905410)
IC50 2±n/a nM
Citation Nagarajan, SRLu, HFGasiecki, AFKhanna, IKParikh, MDDesai, BNRogers, TEClare, MChen, BBRussell, MAKeene, JLDuffin, TEngleman, VWFinn, MBFreeman, SKKlover, JANickols, GANickols, MAShannon, KESteininger, CAWestlin, WFWestlin, MMWilliams, ML Discovery of +(2-{4-[2-(5,6,7,8-tetrahydro-1,8-naphthyridin-2-yl)ethoxy]phenyl}-cyclopropyl)acetic acid as potent and selective alphavbeta3 inhibitor: design, synthesis, and optimization. Bioorg Med Chem15:3390-412 (2007) 
 
Integrin alpha-V/beta-3
Name:Integrin alpha-V/beta-3
Type:Enzyme
Mol. Mass.:n/a
Description:n/a
Components:This complex has 2 components.
Component 1
Name:Integrin alpha-V
Synonyms:ITAV_HUMAN Integrin alpha-V/alpha-5 VNRA Vitronectin receptor | Vitronectin receptor subunit alpha
Type:PROTEIN
Mol. Mass.:116024.92
Organism:Homo sapiens (Human)
Description:ChEMBL_582336
Residue:1048
Component 2
Name:Integrin beta-3
Synonyms:CD_antigen=CD61 GPIIIa ITGB3 Platelet membrane glycoprotein IIIa
Type:Protein
Mol. Mass.:87038.91
Organism:Homo sapiens (Human)
Description:P05106
Residue:788
BDBM50209133
NameBDBM50209133
Synonyms:(2-{2,3-difluoro-4-[2-(5,6,7,8-tetrahydro-1,8-naphthyridin-2-yl)ethoxy]-phenyl}cyclopropyl)acetic acid | CHEMBL425299
TypeSmall organic molecule
Emp. Form.C21H22F2N2O3
Mol. Mass.388.4078
SMILESOC(=O)CC1CC1c1ccc(OCCc2ccc3CCCNc3n2)c(F)c1F