Reaction Details
TargetSodium-dependent serotonin transporter
LigandBDBM50209168
Substrate/Competitorn/a
Meas. Tech.ChEMBL_443463 (CHEMBL893721)
IC50 0.4±n/a nM
Citation Deskus, JAEpperson, JRSloan, CPCipollina, JADextraze, PQian-Cutrone, JGao, QMa, BBeno, BRMattson, GKMolski, TFKrause, RGTaber, MTLodge, NJMattson, RJ Conformationally restricted homotryptamines 3. Indole tetrahydropyridines and cyclohexenylamines as selective serotonin reuptake inhibitors. Bioorg Med Chem Lett17:3099-104 (2007) 
 
Sodium-dependent serotonin transporter
Name:Sodium-dependent serotonin transporter
Type:Multi-pass membrane protein
Mol. Mass.:70322.51
Organism:Homo sapiens (Human)
Description:P31645
Residue:630
BDBM50209168
NameBDBM50209168
Synonyms:(R)-3-(4-(dimethylamino)cyclohex-1-enyl)-1H-indole-5-carbonitrile | CHEMBL234706
TypeSmall organic molecule
Emp. Form.C17H19N3
Mol. Mass.265.3529
SMILESCN(C)[C@@H]1CCC(=CC1)c1c[nH]c2ccc(cc12)C#N