Reaction Details
TargetC-C chemokine receptor type 4
LigandBDBM50209253
Substrate/Competitorn/a
Meas. Tech.ChEMBL_455257 (CHEMBL906418)
Ki 530±n/a nM
Citation Burdi, DFChi, SMattia, KHarrington, CShi, ZChen, SJacutin-Porte, SBennett, RCarson, KYin, WKansra, VGonzalo, JACoyle, AJaffee, BOcain, THodge, MLaRosa, GHarriman, G Small molecule antagonists of the CC chemokine receptor 4 (CCR4). Bioorg Med Chem Lett17:3141-5 (2007) 
 
C-C chemokine receptor type 4
Name:C-C chemokine receptor type 4
Type:Enzyme
Mol. Mass.:41406.41
Organism:Homo sapiens (Human)
Description:P51679
Residue:360
BDBM50209253
NameBDBM50209253
Synonyms:(S)-2-(2-(4-(1-(5-chloronaphthalen-2-ylsulfonyl)-N-methylpyrrolidine-2-carboxamido)piperidin-1-yl)ethyl)benzoic acid | CHEMBL397848
TypeSmall organic molecule
Emp. Form.C30H34ClN3O5S
Mol. Mass.584.126
SMILESCN(C1CCN(CCc2ccccc2C(O)=O)CC1)C(=O)[C@@H]1CCCN1S(=O)(=O)c1ccc2c(Cl)cccc2c1