Reaction Details
TargetC-C chemokine receptor type 4
LigandBDBM50209270
Substrate/Competitorn/a
Meas. Tech.ChEMBL_455257 (CHEMBL906418)
Ki 4600±n/a nM
Citation Burdi, DFChi, SMattia, KHarrington, CShi, ZChen, SJacutin-Porte, SBennett, RCarson, KYin, WKansra, VGonzalo, JACoyle, AJaffee, BOcain, THodge, MLaRosa, GHarriman, G Small molecule antagonists of the CC chemokine receptor 4 (CCR4). Bioorg Med Chem Lett17:3141-5 (2007) 
 
C-C chemokine receptor type 4
Name:C-C chemokine receptor type 4
Type:Enzyme
Mol. Mass.:41406.41
Organism:Homo sapiens (Human)
Description:P51679
Residue:360
BDBM50209270
NameBDBM50209270
Synonyms:(S)-N-(1-benzylpiperidin-4-yl)-1-(naphthalen-2-ylsulfonyl)pyrrolidine-2-carboxamide | CHEMBL247976
TypeSmall organic molecule
Emp. Form.C27H31N3O3S
Mol. Mass.477.618
SMILESO=C(NC1CCN(Cc2ccccc2)CC1)[C@@H]1CCCN1S(=O)(=O)c1ccc2ccccc2c1