Reaction Details
TargetC-C chemokine receptor type 4
LigandBDBM50209260
Substrate/Competitorn/a
Meas. Tech.ChEMBL_455258 (CHEMBL903232)
Ki 150±n/a nM
Citation Burdi, DFChi, SMattia, KHarrington, CShi, ZChen, SJacutin-Porte, SBennett, RCarson, KYin, WKansra, VGonzalo, JACoyle, AJaffee, BOcain, THodge, MLaRosa, GHarriman, G Small molecule antagonists of the CC chemokine receptor 4 (CCR4). Bioorg Med Chem Lett17:3141-5 (2007) 
 
C-C chemokine receptor type 4
Name:C-C chemokine receptor type 4
Type:Enzyme
Mol. Mass.:41406.41
Organism:Homo sapiens (Human)
Description:P51679
Residue:360
BDBM50209260
NameBDBM50209260
Synonyms:(S)-1-(5-chloronaphthalen-2-ylsulfonyl)-N-methyl-N-(1-phenethylpiperidin-4-yl)pyrrolidine-2-carboxamide | CHEMBL246334
TypeSmall organic molecule
Emp. Form.C29H34ClN3O3S
Mol. Mass.540.117
SMILESCN(C1CCN(CCc2ccccc2)CC1)C(=O)[C@@H]1CCCN1S(=O)(=O)c1ccc2c(Cl)cccc2c1