Reaction Details
TargetC-C chemokine receptor type 4
LigandBDBM50209272
Substrate/Competitorn/a
Meas. Tech.ChEMBL_455257 (CHEMBL906418)
Ki>10000±n/a nM
Citation Burdi, DFChi, SMattia, KHarrington, CShi, ZChen, SJacutin-Porte, SBennett, RCarson, KYin, WKansra, VGonzalo, JACoyle, AJaffee, BOcain, THodge, MLaRosa, GHarriman, G Small molecule antagonists of the CC chemokine receptor 4 (CCR4). Bioorg Med Chem Lett17:3141-5 (2007) 
 
C-C chemokine receptor type 4
Name:C-C chemokine receptor type 4
Type:Enzyme
Mol. Mass.:41406.41
Organism:Homo sapiens (Human)
Description:P51679
Residue:360
BDBM50209272
NameBDBM50209272
Synonyms:(S)-1-(naphthalen-2-ylsulfonyl)-N-(1-(pyridin-2-ylmethyl)piperidin-4-yl)pyrrolidine-2-carboxamide | CHEMBL394467
TypeSmall organic molecule
Emp. Form.C26H30N4O3S
Mol. Mass.478.606
SMILESO=C(NC1CCN(Cc2ccccn2)CC1)[C@@H]1CCCN1S(=O)(=O)c1ccc2ccccc2c1