Reaction Details
TargetC-C chemokine receptor type 4
LigandBDBM50209278
Substrate/Competitorn/a
Meas. Tech.ChEMBL_455257 (CHEMBL906418)
Ki 240±n/a nM
Citation Burdi, DFChi, SMattia, KHarrington, CShi, ZChen, SJacutin-Porte, SBennett, RCarson, KYin, WKansra, VGonzalo, JACoyle, AJaffee, BOcain, THodge, MLaRosa, GHarriman, G Small molecule antagonists of the CC chemokine receptor 4 (CCR4). Bioorg Med Chem Lett17:3141-5 (2007) 
 
C-C chemokine receptor type 4
Name:C-C chemokine receptor type 4
Type:Enzyme
Mol. Mass.:41406.41
Organism:Homo sapiens (Human)
Description:P51679
Residue:360
BDBM50209278
NameBDBM50209278
Synonyms:(S)-N-(1-(2-carbamoylphenethyl)piperidin-4-yl)-1-(5-chloronaphthalen-2-ylsulfonyl)-N-methylpyrrolidine-2-carboxamide | CHEMBL245730
TypeSmall organic molecule
Emp. Form.C30H35ClN4O4S
Mol. Mass.583.141
SMILESCN(C1CCN(CCc2ccccc2C(N)=O)CC1)C(=O)[C@@H]1CCCN1S(=O)(=O)c1ccc2c(Cl)cccc2c1