Reaction Details
TargetIntegrin alpha-V/beta-3
LigandBDBM50209452
Substrate/Competitorn/a
Meas. Tech.ChEMBL_443533 (CHEMBL893790)
IC50 2±n/a nM
Citation Nagarajan, SRDevadas, BMalecha, JWLu, HFRuminski, PGRico, JGRogers, TEMarrufo, LDCollins, JTKleine, HPLantz, MKZhu, JGreen, NFRussell, MALandis, BHMiller, LMMeyer, DMDuffin, TDEngleman, VWFinn, MBFreeman, SKGriggs, DWWilliams, MLNickols, MAPegg, JAShannon, KESteininger, CWestlin, MMNickols, GAKeene, JL R-isomers of Arg-Gly-Asp (RGD) mimics as potent alphavbeta3 inhibitors. Bioorg Med Chem15:3783-800 (2007) 
 
Integrin alpha-V/beta-3
Name:Integrin alpha-V/beta-3
Type:Enzyme
Mol. Mass.:n/a
Description:n/a
Components:This complex has 2 components.
Component 1
Name:Integrin alpha-V
Synonyms:ITAV_HUMAN Integrin alpha-V/alpha-5 VNRA Vitronectin receptor | Vitronectin receptor subunit alpha
Type:PROTEIN
Mol. Mass.:116024.92
Organism:Homo sapiens (Human)
Description:ChEMBL_582336
Residue:1048
Component 2
Name:Integrin beta-3
Synonyms:CD_antigen=CD61 GPIIIa ITGB3 Platelet membrane glycoprotein IIIa
Type:Protein
Mol. Mass.:87038.91
Organism:Homo sapiens (Human)
Description:P05106
Residue:788
BDBM50209452
NameBDBM50209452
Synonyms:(S)-3-(3-bromo-5-chloro-2-hydroxyphenyl)-3-(2-(3-(1,4,5,6-tetrahydropyrimidin-2-ylamino)benzamido)acetamido)propanoic acid | CHEMBL243803
TypeSmall organic molecule
Emp. Form.C22H23BrClN5O5
Mol. Mass.552.806
SMILES[#8]-[#6](=O)-[#6]-[#6@H](-[#7]-[#6](=O)-[#6]-[#7]-[#6](=O)-c1cccc(c1)\[#7]=[#6]-1\[#7]-[#6]-[#6]-[#6]-[#7]-1)-c1cc(Cl)cc(Br)c1-[#8]