Reaction Details
TargetIntegrin alpha-V/beta-3
LigandBDBM50209467
Substrate/Competitorn/a
Meas. Tech.ChEMBL_443533 (CHEMBL893790)
IC50 5±n/a nM
Citation Nagarajan, SRDevadas, BMalecha, JWLu, HFRuminski, PGRico, JGRogers, TEMarrufo, LDCollins, JTKleine, HPLantz, MKZhu, JGreen, NFRussell, MALandis, BHMiller, LMMeyer, DMDuffin, TDEngleman, VWFinn, MBFreeman, SKGriggs, DWWilliams, MLNickols, MAPegg, JAShannon, KESteininger, CWestlin, MMNickols, GAKeene, JL R-isomers of Arg-Gly-Asp (RGD) mimics as potent alphavbeta3 inhibitors. Bioorg Med Chem15:3783-800 (2007) 
 
Integrin alpha-V/beta-3
Name:Integrin alpha-V/beta-3
Type:Enzyme
Mol. Mass.:n/a
Description:n/a
Components:This complex has 2 components.
Component 1
Name:Integrin alpha-V
Synonyms:ITAV_HUMAN Integrin alpha-V/alpha-5 VNRA Vitronectin receptor | Vitronectin receptor subunit alpha
Type:PROTEIN
Mol. Mass.:116024.92
Organism:Homo sapiens (Human)
Description:ChEMBL_582336
Residue:1048
Component 2
Name:Integrin beta-3
Synonyms:CD_antigen=CD61 GPIIIa ITGB3 Platelet membrane glycoprotein IIIa
Type:Protein
Mol. Mass.:87038.91
Organism:Homo sapiens (Human)
Description:P05106
Residue:788
BDBM50209467
NameBDBM50209467
Synonyms:(S)-3-(3-bromo-5-chloro-2-hydroxyphenyl)-3-(2-(3-(5,5-difluoro-1,4,5,6-tetrahydropyrimidin-2-ylamino)-5-hydroxybenzamido)acetamido)propanoic acid | CHEMBL242986
TypeSmall organic molecule
Emp. Form.C22H21BrClF2N5O6
Mol. Mass.604.786
SMILES[#8]-[#6](=O)-[#6]-[#6@H](-[#7]-[#6](=O)-[#6]-[#7]-[#6](=O)-c1cc(-[#8])cc(c1)\[#7]=[#6]-1\[#7]-[#6]C(F)(F)[#6]-[#7]-1)-c1cc(Cl)cc(Br)c1-[#8]