Reaction Details
TargetIntegrin alpha-V/beta-6
LigandBDBM50209475
Substrate/Competitorn/a
Meas. Tech.ChEMBL_443535 (CHEMBL893792)
IC50 20±n/a nM
Citation Nagarajan, SRDevadas, BMalecha, JWLu, HFRuminski, PGRico, JGRogers, TEMarrufo, LDCollins, JTKleine, HPLantz, MKZhu, JGreen, NFRussell, MALandis, BHMiller, LMMeyer, DMDuffin, TDEngleman, VWFinn, MBFreeman, SKGriggs, DWWilliams, MLNickols, MAPegg, JAShannon, KESteininger, CWestlin, MMNickols, GAKeene, JL R-isomers of Arg-Gly-Asp (RGD) mimics as potent alphavbeta3 inhibitors. Bioorg Med Chem15:3783-800 (2007) 
 
Integrin alpha-V/beta-6
Name:Integrin alpha-V/beta-6
Type:Enzyme
Mol. Mass.:n/a
Description:n/a
Components:This complex has 2 components.
Component 1
Name:Integrin alpha-V
Synonyms:ITAV_HUMAN Integrin alpha-V/alpha-5 VNRA Vitronectin receptor | Vitronectin receptor subunit alpha
Type:PROTEIN
Mol. Mass.:116024.92
Organism:Homo sapiens (Human)
Description:ChEMBL_582336
Residue:1048
Component 2
Name:Integrin beta-6
Synonyms:ITB6_HUMAN | ITGB6
Type:PROTEIN
Mol. Mass.:85919.61
Organism:Homo sapiens (Human)
Description:EBI_10916
Residue:788
BDBM50209475
NameBDBM50209475
Synonyms:(3R)-3-(3,5-dichloro-2-hydroxyphenyl)-3-(2-(3-(5-hydroxy-1,4,5,6-tetrahydropyrimidin-2-ylamino)benzamido)acetamido)propanoic acid | CHEMBL242717
TypeSmall organic molecule
Emp. Form.C22H23Cl2N5O6
Mol. Mass.524.354
SMILES[#8]-[#6]-1-[#6]-[#7]\[#6](-[#7]-[#6]-1)=[#7]\c1cccc(c1)-[#6](=O)-[#7]-[#6]-[#6](=O)-[#7]-[#6@H](-[#6]-[#6](-[#8])=O)-c1cc(Cl)cc(Cl)c1-[#8]