Reaction Details
TargetcAMP and cAMP-inhibited cGMP 3',5'-cyclic phosphodiesterase 10A
LigandBDBM50209539
Substrate/Competitorn/a
Meas. Tech.ChEMBL_455270 (CHEMBL886046)
IC50 3±n/a nM
Citation Cantin, LDMagnuson, SGunn, DBarucci, NBreuhaus, MBullock, WHBurke, JClaus, THDaly, MDecarr, LGore-Willse, AHoover-Litty, HKumarasinghe, ESLi, YLiang, SXLivingston, JNLowinger, TMacdougall, MOgutu, HOOlague, AOtt-Morgan, RSchoenleber, RWTersteegen, AWickens, PZhang, ZZhu, JZhu, LSweet, LJ PDE-10A inhibitors as insulin secretagogues. Bioorg Med Chem Lett17:2869-73 (2007) 
 
cAMP and cAMP-inhibited cGMP 3',5'-cyclic phosphodiesterase 10A
Name:cAMP and cAMP-inhibited cGMP 3',5'-cyclic phosphodiesterase 10A
Type:Protein
Mol. Mass.:88412.52
Organism:Homo sapiens (Human)
Description:Q9Y233
Residue:779
BDBM50209539
NameBDBM50209539
Synonyms:2-[3-cyano-2-(2'-ethoxy-biphenyl-4-yl)-6-fluoro-quinolin-4-ylamino]-3-phenyl-propionic acid | CHEMBL245710
TypeSmall organic molecule
Emp. Form.C33H26FN3O3
Mol. Mass.531.5762
SMILESCCOc1ccccc1-c1ccc(cc1)-c1nc2ccc(F)cc2c(NC(Cc2ccccc2)C(O)=O)c1C#N