Reaction Details
TargetPlasmepsin II
LigandBDBM50209563
Substrate/Competitorn/a
Meas. Tech.ChEMBL_438604 (CHEMBL887761)
Ki 4±n/a nM
Citation Hidaka, KKimura, TTsuchiya, YKamiya, MRuben, AJFreire, EHayashi, YKiso, Y Additional interaction of allophenylnorstatine-containing tripeptidomimetics with malarial aspartic protease plasmepsin II. Bioorg Med Chem Lett17:3048-52 (2007) 
 
Plasmepsin II
Name:Plasmepsin II
Type:Enzyme
Mol. Mass.:51482.09
Organism:Plasmodium falciparum
Description:P46925
Residue:453
BDBM50209563
NameBDBM50209563
Synonyms:(R)-N-((1S,2R)-2-hydroxy-2,3-dihydro-1H-inden-1-yl)-3-((2S,3S)-2-hydroxy-3-((R)-2-(2-(4-methoxyphenyl)acetamido)-3-(methylthio)propanamido)-4-phenylbutanoyl)-5,5-dimethylthiazolidine-4-carboxamide KNI-10315
TypeSmall organic molecule
Emp. Form.C38H46N4O7S2
Mol. Mass.734.924
SMILESCOc1ccc(CC(=O)N[C@@H](CSC)C(=O)N[C@@H](Cc2ccccc2)[C@H](O)C(=O)N2CSC(C)(C)[C@H]2C(=O)N[C@@H]2[C@H](O)Cc3ccccc23)cc1