Reaction Details
TargetPlasmepsin II
LigandBDBM50209566
Substrate/Competitorn/a
Meas. Tech.ChEMBL_438604 (CHEMBL887761)
Ki 9±n/a nM
Citation Hidaka, KKimura, TTsuchiya, YKamiya, MRuben, AJFreire, EHayashi, YKiso, Y Additional interaction of allophenylnorstatine-containing tripeptidomimetics with malarial aspartic protease plasmepsin II. Bioorg Med Chem Lett17:3048-52 (2007) 
 
Plasmepsin II
Name:Plasmepsin II
Type:Enzyme
Mol. Mass.:51482.09
Organism:Plasmodium falciparum
Description:P46925
Residue:453
BDBM50209566
NameBDBM50209566
Synonyms:(R)-N-((1S,2R)-2-hydroxy-2,3-dihydro-1H-inden-1-yl)-3-((2S,3S)-2-hydroxy-3-((R)-3-(methylthio)-2-(4-oxo-4H-chromene-2-carboxamido)propanamido)-4-phenylbutanoyl)-5,5-dimethylthiazolidine-4-carboxamide KNI-10062
TypeSmall organic molecule
Emp. Form.C39H42N4O8S2
Mol. Mass.758.903
SMILESCSC[C@H](NC(=O)c1cc(=O)c2ccccc2o1)C(=O)N[C@@H](Cc1ccccc1)[C@H](O)C(=O)N1CSC(C)(C)[C@H]1C(=O)N[C@@H]1[C@H](O)Cc2ccccc12