Reaction Details
TargetB1 bradykinin receptor
LigandBDBM50209749
Substrate/Competitorn/a
Meas. Tech.ChEMBL_434361 (CHEMBL919420)
IC50 17±n/a nM
Citation Biswas, KLi, AChen, JJD'Amico, DCFotsch, CHan, NHuman, JLiu, QNorman, MHRiahi, BYuan, CSuzuki, HMareska, DAZhan, JClarke, DEToro, AGroneberg, RDBurgess, LELester-Zeiner, DBiddlecome, GManning, BHArik, LDong, HHuang, MKamassah, ALoeloff, RSun, HHsieh, FYKumar, GNg, GYHungate, RWAskew, BCJohnson, E Potent nonpeptide antagonists of the bradykinin B1 receptor: structure-activity relationship studies with novel diaminochroman carboxamides. J Med Chem50:2200-12 (2007) 
 
B1 bradykinin receptor
Name:B1 bradykinin receptor
Type:Enzyme
Mol. Mass.:40508.87
Organism:Homo sapiens (Human)
Description:P46663
Residue:353
BDBM50209749
NameBDBM50209749
Synonyms:(R)-N-((R)-7-((tert-butylamino)methyl)chroman-4-yl)-3-(naphthalene-3-sulfonamido)-3-phenylpropanamide | CHEMBL227879
TypeSmall organic molecule
Emp. Form.C33H37N3O4S
Mol. Mass.571.73
SMILESCC(C)(C)NCc1ccc2[C@@H](CCOc2c1)NC(=O)C[C@@H](NS(=O)(=O)c1ccc2ccccc2c1)c1ccccc1