Reaction Details
TargetHistamine H3 receptor
LigandBDBM50209805
Substrate/Competitorn/a
Meas. Tech.ChEMBL_455315 (CHEMBL886091)
Ki 0.9±n/a nM
Citation Stocking, EMMiller, JMBarbier, AJWilson, SJBoggs, JDMcAllister, HMWu, JLovenberg, TWCarruthers, NIWolin, RL Synthesis and biological evaluation of diamine-based histamine H3 antagonists with serotonin reuptake inhibitor activity. Bioorg Med Chem Lett17:3130-5 (2007) 
 
Histamine H3 receptor
Name:Histamine H3 receptor
Type:G Protein-Coupled Receptor (GPCR)
Mol. Mass.:48691.47
Organism:Homo sapiens (Human)
Description:Binding assays were using CHO cells stably expressing hH3R receptors.
Residue:445
BDBM50209805
NameBDBM50209805
Synonyms:3-(3-chlorophenoxy)-N,N-dimethyl-3-(4-(3-(piperidin-1-yl)propoxy)phenyl)propan-1-amine | CHEMBL245919
TypeSmall organic molecule
Emp. Form.C25H35ClN2O2
Mol. Mass.431.011
SMILESCN(C)CCC(Oc1cccc(Cl)c1)c1ccc(OCCCN2CCCCC2)cc1