Reaction Details
TargetHistamine H3 receptor
LigandBDBM50209810
Substrate/Competitorn/a
Meas. Tech.ChEMBL_455315 (CHEMBL886091)
Ki 0.7±n/a nM
Citation Stocking, EMMiller, JMBarbier, AJWilson, SJBoggs, JDMcAllister, HMWu, JLovenberg, TWCarruthers, NIWolin, RL Synthesis and biological evaluation of diamine-based histamine H3 antagonists with serotonin reuptake inhibitor activity. Bioorg Med Chem Lett17:3130-5 (2007) 
 
Histamine H3 receptor
Name:Histamine H3 receptor
Type:G Protein-Coupled Receptor (GPCR)
Mol. Mass.:48691.47
Organism:Homo sapiens (Human)
Description:Binding assays were using CHO cells stably expressing hH3R receptors.
Residue:445
BDBM50209810
NameBDBM50209810
Synonyms:CHEMBL245516 | N,N-dimethyl-3-(4-(3-(piperidin-1-yl)propoxy)phenyl)-3-(p-tolyloxy)propan-1-amine
TypeSmall organic molecule
Emp. Form.C26H38N2O2
Mol. Mass.410.5921
SMILESCN(C)CCC(Oc1ccc(C)cc1)c1ccc(OCCCN2CCCCC2)cc1