Reaction Details
TargetHistamine H3 receptor
LigandBDBM50209804
Substrate/Competitorn/a
Meas. Tech.ChEMBL_455315 (CHEMBL886091)
Ki 1.3±n/a nM
Citation Stocking, EMMiller, JMBarbier, AJWilson, SJBoggs, JDMcAllister, HMWu, JLovenberg, TWCarruthers, NIWolin, RL Synthesis and biological evaluation of diamine-based histamine H3 antagonists with serotonin reuptake inhibitor activity. Bioorg Med Chem Lett17:3130-5 (2007) 
 
Histamine H3 receptor
Name:Histamine H3 receptor
Type:G Protein-Coupled Receptor (GPCR)
Mol. Mass.:48691.47
Organism:Homo sapiens (Human)
Description:Binding assays were using CHO cells stably expressing hH3R receptors.
Residue:445
BDBM50209804
NameBDBM50209804
Synonyms:CHEMBL245515 | N,N-dimethyl-3-phenoxy-3-(4-(4-(piperidin-1-yl)but-1-ynyl)phenyl)propan-1-amine
TypeSmall organic molecule
Emp. Form.C26H34N2O
Mol. Mass.390.561
SMILESCN(C)CCC(Oc1ccccc1)c1ccc(cc1)C#CCCN1CCCCC1