Reaction Details
TargetC-C chemokine receptor type 3
LigandBDBM50210001
Substrate/Competitorn/a
Meas. Tech.ChEMBL_458974 (CHEMBL925069)
IC50 2±n/a nM
Citation Pruitt, JRBatt, DGWacker, DABostrom, LLBooker, SKMcLaughlin, EHoughton, GCVarnes, JGChrist, DDCovington, MDas, AMDavies, PGraden, DKariv, IOrlovsky, YStowell, NCVaddi, KGWadman, EAWelch, PKYeleswaram, SSolomon, KANewton, RCDecicco, CPCarter, PHKo, SS CC chemokine receptor-3 (CCR3) antagonists: improving the selectivity of DPC168 by reducing central ring lipophilicity. Bioorg Med Chem Lett17:2992-7 (2007) 
 
C-C chemokine receptor type 3
Name:C-C chemokine receptor type 3
Type:Enzyme
Mol. Mass.:41053.88
Organism:Homo sapiens (Human)
Description:P51677
Residue:355
BDBM50210001
NameBDBM50210001
Synonyms:1-((3S,4S)-4-(((S)-3-(4-fluorobenzyl)piperidin-1-yl)methyl)-1-(1-acetylpiperidin-4-yl)piperidin-3-yl)-3-(5-acetyl-4-methylthiazol-2-yl)urea | CHEMBL399893
TypeSmall organic molecule
Emp. Form.C32H45FN6O3S
Mol. Mass.612.802
SMILESCC(=O)N1CCC(CC1)N1CC[C@@H](CN2CCC[C@@H](Cc3ccc(F)cc3)C2)[C@@H](C1)NC(=O)Nc1nc(C)c(s1)C(C)=O