Reaction Details
TargetCytochrome P450 2D6
LigandBDBM50210020
Substrate/Competitorn/a
Meas. Tech.ChEMBL_458976 (CHEMBL925068)
IC50 1100±n/a nM
Citation Pruitt, JRBatt, DGWacker, DABostrom, LLBooker, SKMcLaughlin, EHoughton, GCVarnes, JGChrist, DDCovington, MDas, AMDavies, PGraden, DKariv, IOrlovsky, YStowell, NCVaddi, KGWadman, EAWelch, PKYeleswaram, SSolomon, KANewton, RCDecicco, CPCarter, PHKo, SS CC chemokine receptor-3 (CCR3) antagonists: improving the selectivity of DPC168 by reducing central ring lipophilicity. Bioorg Med Chem Lett17:2992-7 (2007) 
 
Cytochrome P450 2D6
Name:Cytochrome P450 2D6
Type:Protein
Mol. Mass.:55774.82
Organism:Homo sapiens (Human)
Description:P10635
Residue:497
BDBM50210020
NameBDBM50210020
Synonyms:1-((3S,4S)-4-(((S)-3-(4-fluorobenzyl)piperidin-1-yl)methyl)-1-(ethylcarbamoyl)piperidin-3-yl)-3-(5-acetyl-4-methylthiazol-2-yl)urea | CHEMBL439253
TypeSmall organic molecule
Emp. Form.C28H39FN6O3S
Mol. Mass.558.711
SMILESCCNC(=O)N1CC[C@@H](CN2CCC[C@@H](Cc3ccc(F)cc3)C2)[C@@H](C1)NC(=O)Nc1nc(C)c(s1)C(C)=O