Reaction Details
Target5-hydroxytryptamine receptor 2A
LigandBDBM50210082
Substrate/Competitorn/a
Meas. Tech.ChEMBL_443936 (CHEMBL893102)
IC50 4700±n/a nM
Citation Feng, ZMohapatra, SKlimko, PGHellberg, MRMay, JAKelly, CWilliams, GMcLaughlin, MASharif, NA Novel benzodifuran analogs as potent 5-HT2A receptor agonists with ocular hypotensive activity. Bioorg Med Chem Lett17:2998-3002 (2007) 
 
5-hydroxytryptamine receptor 2A
Name:5-hydroxytryptamine receptor 2A
Type:G Protein-Coupled Receptor (GPCR)
Mol. Mass.:52852.05
Organism:Rattus norvegicus (rat)
Description:Rat cortex membranes 5-HT2A receptors.
Residue:471
BDBM50210082
NameBDBM50210082
Synonyms:3-[8-((R)-2-amino-propyl)-2,3,6,7-tetrahydro-benzo[1,2-b;4,5-b']difuran-4-yl]-propionic acid | CHEMBL234671
TypeSmall organic molecule
Emp. Form.C16H21NO4
Mol. Mass.291.3422
SMILESC[C@@H](N)Cc1c2CCOc2c(CCC(O)=O)c2CCOc12