Reaction Details
Target5-hydroxytryptamine receptor 2A
LigandBDBM50210089
Substrate/Competitorn/a
Meas. Tech.ChEMBL_443936 (CHEMBL893102)
IC50 0.11±n/a nM
Citation Feng, ZMohapatra, SKlimko, PGHellberg, MRMay, JAKelly, CWilliams, GMcLaughlin, MASharif, NA Novel benzodifuran analogs as potent 5-HT2A receptor agonists with ocular hypotensive activity. Bioorg Med Chem Lett17:2998-3002 (2007) 
 
5-hydroxytryptamine receptor 2A
Name:5-hydroxytryptamine receptor 2A
Type:G Protein-Coupled Receptor (GPCR)
Mol. Mass.:52852.05
Organism:Rattus norvegicus (rat)
Description:Rat cortex membranes 5-HT2A receptors.
Residue:471
BDBM50210089
NameBDBM50210089
Synonyms:(R)-2-(8-methoxymethyl-benzo[1,2-b;4,5-b']difuran-4-yl)-1-methyl-ethylamine | CHEMBL394325
TypeSmall organic molecule
Emp. Form.C15H17NO3
Mol. Mass.259.3004
SMILESCOCc1c2ccoc2c(C[C@@H](C)N)c2ccoc12