Reaction Details
Target5-hydroxytryptamine receptor 2A
LigandBDBM50210087
Substrate/Competitorn/a
Meas. Tech.ChEMBL_443937 (CHEMBL893103)
EC50 175±n/a nM
Citation Feng, ZMohapatra, SKlimko, PGHellberg, MRMay, JAKelly, CWilliams, GMcLaughlin, MASharif, NA Novel benzodifuran analogs as potent 5-HT2A receptor agonists with ocular hypotensive activity. Bioorg Med Chem Lett17:2998-3002 (2007) 
 
5-hydroxytryptamine receptor 2A
Name:5-hydroxytryptamine receptor 2A
Type:G Protein-Coupled Receptor (GPCR)
Mol. Mass.:52852.05
Organism:Rattus norvegicus (rat)
Description:Rat cortex membranes 5-HT2A receptors.
Residue:471
BDBM50210087
NameBDBM50210087
Synonyms:CHEMBL394664 | [8-((R)-2-amino-propyl)-2,3,6,7-tetrahydro-benzo[1,2-b;4,5-b']difuran-4-yl]-methanol
TypeSmall organic molecule
Emp. Form.C14H19NO3
Mol. Mass.249.3056
SMILESC[C@@H](N)Cc1c2CCOc2c(CO)c2CCOc12