Reaction Details
Target5-hydroxytryptamine receptor 2A
LigandBDBM50210092
Substrate/Competitorn/a
Meas. Tech.ChEMBL_443937 (CHEMBL893103)
EC50 26±n/a nM
Citation Feng, ZMohapatra, SKlimko, PGHellberg, MRMay, JAKelly, CWilliams, GMcLaughlin, MASharif, NA Novel benzodifuran analogs as potent 5-HT2A receptor agonists with ocular hypotensive activity. Bioorg Med Chem Lett17:2998-3002 (2007) 
 
5-hydroxytryptamine receptor 2A
Name:5-hydroxytryptamine receptor 2A
Type:G Protein-Coupled Receptor (GPCR)
Mol. Mass.:52852.05
Organism:Rattus norvegicus (rat)
Description:Rat cortex membranes 5-HT2A receptors.
Residue:471
BDBM50210092
NameBDBM50210092
Synonyms:3-[8-((R)-2-amino-propyl)-2,3,6,7-tetrahydro-benzo[1,2-b;4,5-b']difuran-4-yl]-propionic acid methyl ester | CHEMBL394508
TypeSmall organic molecule
Emp. Form.C17H23NO4
Mol. Mass.305.3688
SMILESCOC(=O)CCc1c2CCOc2c(C[C@@H](C)N)c2CCOc12