Reaction Details
Target5-hydroxytryptamine receptor 2A
LigandBDBM50133231
Substrate/Competitorn/a
Meas. Tech.ChEMBL_443936 (CHEMBL893102)
IC50 0.46±n/a nM
Citation Feng, ZMohapatra, SKlimko, PGHellberg, MRMay, JAKelly, CWilliams, GMcLaughlin, MASharif, NA Novel benzodifuran analogs as potent 5-HT2A receptor agonists with ocular hypotensive activity. Bioorg Med Chem Lett17:2998-3002 (2007) 
 
5-hydroxytryptamine receptor 2A
Name:5-hydroxytryptamine receptor 2A
Type:G Protein-Coupled Receptor (GPCR)
Mol. Mass.:52852.05
Organism:Rattus norvegicus (rat)
Description:Rat cortex membranes 5-HT2A receptors.
Residue:471
BDBM50133231
NameBDBM50133231
Synonyms:(R)-1-(4-iodo-2,5-dimethoxyphenyl)propan-2-amine (R)-2-(4-iodo-2,5-dimethoxyphenyl)-1-methylethylamine | CHEMBL134519
TypeSmall organic molecule
Emp. Form.C11H16INO2
Mol. Mass.321.1547
SMILESCOc1cc(C[C@@H](C)N)c(OC)cc1I