Reaction Details
TargetHistone deacetylase 8
LigandBDBM50210141
Substrate/Competitorn/a
Meas. Tech.ChEMBL_434482 (CHEMBL912072)
Ki 5.32±n/a nM
Citation Liu, TKapustin, GEtzkorn, FA Design and synthesis of a potent histone deacetylase inhibitor. J Med Chem50:2003-6 (2007) 
 
Histone deacetylase 8
Name:Histone deacetylase 8
Type:Enzyme
Mol. Mass.:41749.60
Organism:Homo sapiens (Human)
Description:Q9BY41
Residue:377
BDBM50210141
NameBDBM50210141
Synonyms:CHEMBL388195 | methyl (3S,6S,9S)-9-acetamido-6-[5-(hydroxycarbamoyl)pentyl]-5,8-dioxo-4,7-diazabicyclo[9.3.1]pentadeca-1(14),11(15),12-triene-3-carboxylate
TypeSmall organic molecule
Emp. Form.C23H32N4O7
Mol. Mass.476.5228
SMILESCOC(=O)[C@@H]1Cc2cccc(C[C@H](NC(C)=O)C(=O)N[C@@H](CCCCCC(=O)NO)C(=O)N1)c2