Reaction Details
TargetProthrombin
LigandBDBM17643
Substrate/Competitorn/a
Meas. Tech.ChEMBL_455364 (CHEMBL886139)
Ki 367±n/a nM
Citation Young, RJBrown, DBurns-Kurtis, CLChan, CConvery, MAHubbard, JAKelly, HAPateman, AJPatikis, ASenger, SShah, GPToomey, JRWatson, NSZhou, P Selective and dual action orally active inhibitors of thrombin and factor Xa. Bioorg Med Chem Lett17:2927-30 (2007) 
 
Prothrombin
Name:Prothrombin
Type:Protein
Mol. Mass.:70029.57
Organism:Homo sapiens (Human)
Description:P00734
Residue:622
BDBM17643
NameBDBM17643
Synonyms:(E)-2-(5-chlorothiophen-2-yl)-N-[(3S)-1-[(2S)-1-(morpholin-4-yl)-1-oxopropan-2-yl]-2-oxopyrrolidin-3-yl]ethene-1-sulfonamide N-[(3S)-2-oxopyrrolidin-3-yl]sulfonamide, 1f
TypeSmall organic molecule
Emp. Form.C17H22ClN3O5S2
Mol. Mass.447.957
SMILESC[C@H](N1CC[C@H](NS(=O)(=O)\C=C\c2ccc(Cl)s2)C1=O)C(=O)N1CCOCC1