Reaction Details
TargetMu-type opioid receptor
LigandBDBM50210242
Substrate/Competitorn/a
Meas. Tech.ChEMBL_443967 (CHEMBL892114)
Ki 37±n/a nM
Citation Ho, GDBercovici, ATulshian, DGreenlee, WJFawzi, AFernandez, XMcLeod, RLSmith Torhan, AZhang, H Synthesis and structure-activity relationships of 4-hydroxy-4-phenylpiperidines as nociceptin receptor ligands: Part 2. Bioorg Med Chem Lett17:3028-33 (2007) 
 
Mu-type opioid receptor
Name:Mu-type opioid receptor
Type:G Protein-Coupled Receptor (GPCR)
Mol. Mass.:44789.51
Organism:Homo sapiens (Human)
Description:P35372
Residue:400
BDBM50210242
NameBDBM50210242
Synonyms:4-(2-(aminomethyl)phenyl)-1-(bis(2-fluorophenyl)methyl)piperidin-4-ol | CHEMBL233955
TypeSmall organic molecule
Emp. Form.C25H26F2N2O
Mol. Mass.408.4835
SMILESNCc1ccccc1C1(O)CCN(CC1)C(c1ccccc1F)c1ccccc1F