Reaction Details
TargetNociceptin receptor
LigandBDBM50210212
Substrate/Competitorn/a
Meas. Tech.ChEMBL_443964 (CHEMBL892111)
Ki 0.500000±n/a nM
Citation Ho, GDBercovici, ATulshian, DGreenlee, WJFawzi, AFernandez, XMcLeod, RLSmith Torhan, AZhang, H Synthesis and structure-activity relationships of 4-hydroxy-4-phenylpiperidines as nociceptin receptor ligands: Part 2. Bioorg Med Chem Lett17:3028-33 (2007) 
 
Nociceptin receptor
Name:Nociceptin receptor
Type:G Protein-Coupled Receptor (GPCR)
Mol. Mass.:40702.87
Organism:Homo sapiens (Human)
Description:P41146
Residue:370
BDBM50210212
NameBDBM50210212
Synonyms:4-(2-(aminomethyl)phenyl)-1-(bis(2-chlorophenyl)methyl)piperidin-4-ol | CHEMBL233750
TypeSmall organic molecule
Emp. Form.C25H26Cl2N2O
Mol. Mass.441.393
SMILESNCc1ccccc1C1(O)CCN(CC1)C(c1ccccc1Cl)c1ccccc1Cl